{"text_format":"3","workbook":"xlsx","n_sheets":4,"sheets":["1-优秀研究生","2-五好研究生","3-优秀研究生干部","4-研究生单项荣誉"],"not_rendered":{"external_links":1},"read":"whole","date_system":"1900"}

{"sheet":"1-优秀研究生","index":0,"n_rows":276,"n_cols":5,"rows_kept":276,"merged":[[0,0,0,4],[1,0,1,1],[1,2,1,3]]}
["   材料科学与工程学院  “优秀研究生”荣誉称号汇总表"]
["院系名称：材料科学与工程学院",null,"签字（盖章）：",null,"填报日期：2025年10月9日"]
["学号","姓名","综合素质评价结果","所获荣誉称号\n（请填写“优秀研究生”）","备注"]
[22426146,"包晨琛","优秀","优秀研究生"]
[22326092,"毕跃飞","优秀","优秀研究生"]
[12426116,"卜梦凡","优秀","优秀研究生"]
[12126054,"蔡露城","优秀","优秀研究生"]
[12426055,"曾钒毓","优秀","优秀研究生"]
[12526023,"曾飞鸿","优秀","优秀研究生"]
[22326030,"陈国栗","优秀","优秀研究生"]
[12426096,"陈汉阳","优秀","优秀研究生"]
[12126075,"陈泓旭","优秀","优秀研究生"]
[22426010,"陈稼臻","优秀","优秀研究生"]
[12426020,"陈龙","优秀","优秀研究生"]
[12226023,"陈明子","优秀","优秀研究生"]
[22326075,"陈婷婷","优秀","优秀研究生"]
[12126074,"陈星宇","优秀","优秀研究生"]
[12526017,"陈宇晖","优秀","优秀研究生"]
[22326043,"陈周萍","优秀","优秀研究生"]
[22426067,"程斐扬","优秀","优秀研究生"]
[22426100,"程敏","优秀","优秀研究生"]
[12226072,"储非","优秀","优秀研究生"]
[12426041,"储迎宇","优秀","优秀研究生"]
[22326095,"崔凯旋","优秀","优秀研究生"]
[12126033,"崔翘鹏","优秀","优秀研究生"]
[12126031,"戴子翔","优秀","优秀研究生"]
[22326116,"党萍萍","优秀","优秀研究生"]
[22326005,"翟羽佳","优秀","优秀研究生"]
[12226065,"丁素娟","优秀","优秀研究生"]
[12526090,"杜管诗涵","优秀","优秀研究生"]
[22326093,"杜温杰","优秀","优秀研究生"]
[12226046,"段欢畅","优秀","优秀研究生"]
[12126073,"范思源","优秀","优秀研究生"]
[12126046,"范云鹏","优秀","优秀研究生"]
[12426036,"方子铭","优秀","优秀研究生"]
[22426005,"冯杨媛","优秀","优秀研究生"]
[12326032,"冯逸丰","优秀","优秀研究生"]
[22326119,"付依","优秀","优秀研究生"]
[22426114,"高邦帅","优秀","优秀研究生"]
[12126080,"高许","优秀","优秀研究生"]
[22426056,"高旭东","优秀","优秀研究生"]
[12326100,"高续洪","优秀","优秀研究生"]
[12426069,"葛天乐","优秀","优秀研究生"]
[22326054,"葛羽中","优秀","优秀研究生"]
[12426027,"弓佳燕","优秀","优秀研究生"]
[22326127,"谷相宜","优秀","优秀研究生"]
[12226097,"郭金泽","优秀","优秀研究生"]
[12326047,"郭静筠","优秀","优秀研究生"]
[12126038,"郭威","优秀","优秀研究生"]
[12326108,"郭晓云","优秀","优秀研究生"]
[22326018,"郭喆","优秀","优秀研究生"]
[12226049,"韩君玮","优秀","优秀研究生"]
[12326089,"韩思佳","优秀","优秀研究生"]
[12226077,"韩雪","优秀","优秀研究生"]
[12226026,"郝逸展","优秀","优秀研究生"]
[12226040,"郝重阳","优秀","优秀研究生"]
[12226053,"何超威","优秀","优秀研究生"]
[22426033,"洪彦棋","优秀","优秀研究生"]
[12426088,"侯俊杰","优秀","优秀研究生"]
[12426060,"侯徐泳","优秀","优秀研究生"]
[22426120,"胡安荣","优秀","优秀研究生"]
[12326042,"胡杜楠","优秀","优秀研究生"]
[12526015,"胡丽蓉","优秀","优秀研究生"]
[12226056,"胡炜媛","优秀","优秀研究生"]
[12426030,"黄含艳","优秀","优秀研究生"]
[12126028,"黄慧琴","优秀","优秀研究生"]
[12226070,"黄梓航","优秀","优秀研究生"]
[12126024,"贾喻晓","优秀","优秀研究生"]
[22426081,"江欣","优秀","优秀研究生"]
[12526031,"蒋嘉惠琦","优秀","优秀研究生"]
[22426015,"蒋嘉蔚","优秀","优秀研究生"]
[22326132,"蒋双婷","优秀","优秀研究生"]
[22326097,"蒋昕捷","优秀","优秀研究生"]
[12326044,"解昕宇","优秀","优秀研究生"]
[12426016,"金东尔","优秀","优秀研究生"]
[22426011,"靳思雨","优秀","优秀研究生"]
[12126050,"鞠志杰","优秀","优秀研究生"]
[22326104,"寇元昊","优秀","优秀研究生"]
[12426018,"邝君儿","优秀","优秀研究生"]
[22326060,"雷博睿","优秀","优秀研究生"]
[22326045,"雷诺","优秀","优秀研究生"]
[22426063,"李丹","优秀","优秀研究生"]
[12326106,"李光","优秀","优秀研究生"]
[12426118,"李桂秀","优秀","优秀研究生"]
[22426020,"李涵瑜","优秀","优秀研究生"]
[12226095,"李佳","优秀","优秀研究生"]
[12226024,"李佳乐","优秀","优秀研究生"]
["22426071","李骏城","优秀","优秀研究生"]
[12426109,"李莲瑜","优秀","优秀研究生"]
[12226017,"李萍萍","优秀","优秀研究生"]
[12326055,"李婷","优秀","优秀研究生"]
[12226074,"李文丽","优秀","优秀研究生"]
[12326036,"李闻天","优秀","优秀研究生"]
[12326069,"李想","优秀","优秀研究生"]
[12226087,"李昕阔","优秀","优秀研究生"]
[12126027,"李旭","优秀","优秀研究生"]
[12126082,"李昱征","优秀","优秀研究生"]
[12426013,"李云龙","优秀","优秀研究生"]
[22426057,"李梓言","优秀","优秀研究生"]
[22326051,"厉梦璐","优秀","优秀研究生"]
[22426123,"栗艳磊","优秀","优秀研究生"]
[12326059,"梁珈源","优秀","优秀研究生"]
[12126022,"林春曦","优秀","优秀研究生"]
[12326029,"林煌","优秀","优秀研究生"]
[12126077,"林珈民","优秀","优秀研究生"]
[12326101,"林坪","优秀","优秀研究生"]
[12426005,"林圣涵","优秀","优秀研究生"]
[12326024,"林思宸","优秀","优秀研究生"]
[12426113,"林业超","优秀","优秀研究生"]
[12426012,"刘宸玮","优秀","优秀研究生"]
[12426058,"刘福璞","优秀","优秀研究生"]
[12226044,"刘慧","优秀","优秀研究生"]
[12126026,"刘继伟","优秀","优秀研究生"]
[22426052,"刘嘉璐","优秀","优秀研究生"]
[12226082,"刘可凡","优秀","优秀研究生"]
[22426030,"刘鹏飞","优秀","优秀研究生"]
[12426014,"刘如敏","优秀","优秀研究生"]
[12526016,"刘森","优秀","优秀研究生"]
[12326027,"刘胜昊","优秀","优秀研究生"]
[12126081,"刘硕","优秀","优秀研究生"]
[12226081,"刘雯","优秀","优秀研究生"]
[22426096,"刘心逸","优秀","优秀研究生"]
[12426042,"刘泽元","优秀","优秀研究生"]
[12326014,"刘振武","优秀","优秀研究生"]
[12226018,"娄刚","优秀","优秀研究生"]
[12226076,"娄子晨","优秀","优秀研究生"]
[22426021,"卢嘉敏","优秀","优秀研究生"]
[12426054,"鲁晓楠","优秀","优秀研究生"]
[22326112,"罗希良","优秀","优秀研究生"]
[12126068,"罗祯","优秀","优秀研究生"]
[12426046,"罗子昂","优秀","优秀研究生"]
[12226038,"骆逸欣","优秀","优秀研究生"]
[22426142,"马璐","优秀","优秀研究生"]
[12326097,"孟睿阳","优秀","优秀研究生"]
[22326110,"孟志","优秀","优秀研究生"]
[12526063,"欧翊邦","优秀","优秀研究生"]
[12426004,"裴振","优秀","优秀研究生"]
[12326079,"钱昇","优秀","优秀研究生"]
[12226085,"秦腾腾","优秀","优秀研究生"]
[22326035,"曲优异","优秀","优秀研究生"]
[22326065,"饶永娴","优秀","优秀研究生"]
[12326111,"阮超","优秀","优秀研究生"]
[22426066,"阮明","优秀","优秀研究生"]
[12326050,"申倩倩","优秀","优秀研究生"]
[12326096,"沈漪杰","优秀","优秀研究生"]
[12326067,"沈云鹏","优秀","优秀研究生"]
[22426076,"史钧达","优秀","优秀研究生"]
[12526009,"宋潇敏","优秀","优秀研究生"]
[22326118,"孙静怡","优秀","优秀研究生"]
[22326023,"孙秀粤","优秀","优秀研究生"]
[12426085,"唐安辰","优秀","优秀研究生"]
[12426056,"唐嘉轩","优秀","优秀研究生"]
[12226057,"滕骥","优秀","优秀研究生"]
[12326039,"田静","优秀","优秀研究生"]
[22426017,"田静若兰","优秀","优秀研究生"]
[12426053,"田君鸿","优秀","优秀研究生"]
[12326072,"田雨竹","优秀","优秀研究生"]
[12426070,"童惠敏","优秀","优秀研究生"]
[12326074,"汪佳俊","优秀","优秀研究生"]
[22326090,"王贝宁","优秀","优秀研究生"]
[12226035,"王琛","优秀","优秀研究生"]
[12326090,"王国强","优秀","优秀研究生"]
[12326084,"王佳倩","优秀","优秀研究生"]
[12426019,"王嘉晖","优秀","优秀研究生"]
[12226042,"王金泽","优秀","优秀研究生"]
[12426080,"王柯浩","优秀","优秀研究生"]
[12226091,"王来滨","优秀","优秀研究生"]
[22326048,"王孟亚","优秀","优秀研究生"]
[12126021,"王敏康","优秀","优秀研究生"]
[12126061,"王茜","优秀","优秀研究生"]
[22326123,"王世昌","优秀","优秀研究生"]
[12526011,"王婷婷","优秀","优秀研究生"]
[12326054,"王婷玉","优秀","优秀研究生"]
[22426077,"王琬菁","优秀","优秀研究生"]
[12326030,"王文波","优秀","优秀研究生"]
[22326129,"王文雅","优秀","优秀研究生"]
[12126047,"王笑","优秀","优秀研究生"]
[12226083,"王昕洋","优秀","优秀研究生"]
[12126072,"王旭","优秀","优秀研究生"]
[12226045,"王严","优秀","优秀研究生"]
[22326036,"王燕","优秀","优秀研究生"]
[12226034,"王耀","优秀","优秀研究生"]
[22426059,"王一卓","优秀","优秀研究生"]
[22426080,"王艺飞","优秀","优秀研究生"]
[12126049,"王昱卜","优秀","优秀研究生"]
[22326039,"王云竹","优秀","优秀研究生"]
[22426023,"王梓同","优秀","优秀研究生"]
[22326111,"王梓懿","优秀","优秀研究生"]
[12326048,"魏吉垚","优秀","优秀研究生"]
[22326013,"魏星","优秀","优秀研究生"]
[12426095,"文星","优秀","优秀研究生"]
[12126017,"沃子浩","优秀","优秀研究生"]
[22326029,"吴佳玲","优秀","优秀研究生"]
[22426138,"吴金哲","优秀","优秀研究生"]
[12326038,"吴梦怡","优秀","优秀研究生"]
[22326098,"吴淇","优秀","优秀研究生"]
[12226030,"吴若楷","优秀","优秀研究生"]
[22326137,"吴涛","优秀","优秀研究生"]
[12526010,"吴天宇","优秀","优秀研究生"]
[12426100,"吴一希","优秀","优秀研究生"]
[12226069,"吴宇轩","优秀","优秀研究生"]
[12226019,"武鹏远","优秀","优秀研究生"]
[12126052,"夏群栋","优秀","优秀研究生"]
[12426007,"夏天昊","优秀","优秀研究生"]
[22426134,"夏鑫宇","优秀","优秀研究生"]
[12426009,"夏宇凡","优秀","优秀研究生"]
[12326002,"夏昭岳","优秀","优秀研究生"]
[12426112,"向阳","优秀","优秀研究生"]
[22426084,"肖奕帆","优秀","优秀研究生"]
[22326089,"辛鑫","优秀","优秀研究生"]
[12226041,"邢传旺","优秀","优秀研究生"]
[22426069,"邢鸣峰","优秀","优秀研究生"]
[12326091,"熊清碧","优秀","优秀研究生"]
[22326050,"徐颖","优秀","优秀研究生"]
[12326110,"许广华","优秀","优秀研究生"]
[22426131,"薛圣玮","优秀","优秀研究生"]
[12326082,"闫浩林","优秀","优秀研究生"]
[12126058,"闫蕾","优秀","优秀研究生"]
[12326052,"闫祺珑","优秀","优秀研究生"]
[22426072,"闫晓彤","优秀","优秀研究生"]
[12326060,"严嘉禾","优秀","优秀研究生"]
[12526001,"严宇超","优秀","优秀研究生"]
[12526008,"杨方雯","优秀","优秀研究生"]
[12126048,"杨月","优秀","优秀研究生"]
[12226093,"杨志逸","优秀","优秀研究生"]
[22426073,"姚芬","优秀","优秀研究生"]
[12126035,"姚姮","优秀","优秀研究生"]
[12326020,"叶佳涛","优秀","优秀研究生"]
[22326074,"叶凌彬","优秀","优秀研究生"]
[12126069,"易思","优秀","优秀研究生"]
[22326007,"殷璟然","优秀","优秀研究生"]
[22426009,"尹添威","优秀","优秀研究生"]
[12526114,"余程航","优秀","优秀研究生"]
[12326065,"詹丽君","优秀","优秀研究生"]
[12226022,"张斌","优秀","优秀研究生"]
[12326049,"张道永","优秀","优秀研究生"]
[12526024,"张方飞园","优秀","优秀研究生"]
[12326073,"张家郡","优秀","优秀研究生"]
[12126076,"张凯","优秀","优秀研究生"]
[12426031,"张可滢","优秀","优秀研究生"]
[22426065,"张利萍","优秀","优秀研究生"]
[12126029,"张瑞安","优秀","优秀研究生"]
[12326083,"张文强","优秀","优秀研究生"]
[12426002,"张正端","优秀","优秀研究生"]
[12126064,"张洲晴","优秀","优秀研究生"]
[12326046,"赵凡雅","优秀","优秀研究生"]
[22426024,"赵江枫","优秀","优秀研究生"]
[22426047,"赵庆龙","优秀","优秀研究生"]
[22326124,"赵宇辰","优秀","优秀研究生"]
[12426115,"赵志浩","优秀","优秀研究生"]
[22326109,"赵壮","优秀","优秀研究生"]
[12326068,"郑浩南","优秀","优秀研究生"]
[22326122,"郑瑞婷","优秀","优秀研究生"]
[22326022,"郑森哲","优秀","优秀研究生"]
[12126034,"郑思楠","优秀","优秀研究生"]
[12426021,"郑鑫颖","优秀","优秀研究生"]
[22326125,"郑雅昕","优秀","优秀研究生"]
[22326028,"郑裕秦","优秀","优秀研究生"]
[12226021,"郑哲帅","优秀","优秀研究生"]
[22326002,"周边边","优秀","优秀研究生"]
[22426046,"周菲","优秀","优秀研究生"]
[12526012,"周福晨","优秀","优秀研究生"]
[12126020,"周富威","优秀","优秀研究生"]
[12326112,"周宁静","优秀","优秀研究生"]
[12326095,"周倩雯","优秀","优秀研究生"]
[12226039,"周扬帆","优秀","优秀研究生"]
[22326061,"周伊静","优秀","优秀研究生"]
[22326083,"周英杰","优秀","优秀研究生"]
[12426084,"周宇轩","优秀","优秀研究生"]
[12126063,"周昱","优秀","优秀研究生"]
[12326102,"周姿","优秀","优秀研究生"]
[12226037,"朱浩南","优秀","优秀研究生"]
[12326078,"朱浩天","优秀","优秀研究生"]
[22426130,"朱静雯","优秀","优秀研究生"]
[22326113,"朱开琦","优秀","优秀研究生"]
[12426086,"朱刘慧","优秀","优秀研究生"]

{"sheet":"2-五好研究生","index":1,"n_rows":146,"n_cols":5,"rows_kept":146,"merged":[[0,0,0,4],[1,0,1,1],[1,2,1,3]]}
["    材料科学与工程学院    “五好研究生”荣誉称号汇总表"]
["院系名称：材料科学与工程学院",null,"签字（盖章）：",null,"填报日期："]
["学号","姓名","综合素质评价结果","所获荣誉称号\n（请填写“五好研究生”）","备注"]
[12126054,"蔡露城","优秀","五好研究生"]
[12426055,"曾钒毓","优秀","五好研究生"]
[12426096,"陈汉阳","优秀","五号研究生"]
[12126075,"陈泓旭","优秀","五好研究生"]
[12226023,"陈明子","优秀","五号研究生"]
[22326075,"陈婷婷","优秀","五好研究生"]
[12126074,"陈星宇","优秀","五好研究生"]
[12526017,"陈宇晖","优秀","五号研究生"]
[22326043,"陈周萍","优秀","五好研究生"]
[22426100,"程敏","优秀","五好研究生"]
[12226072,"储非","优秀","五好研究生"]
[22326095,"崔凯旋","优秀","五好研究生"]
[12126031,"戴子翔","优秀","五好研究生"]
[22326116,"党萍萍","优秀","五好研究生"]
[12226065,"丁素娟","优秀","五号研究生"]
[12526090,"杜管诗涵","优秀","五好研究生"]
[22326093,"杜温杰","优秀","五好研究生"]
[12226046,"段欢畅","优秀","五好研究生"]
[12126073,"范思源","优秀","五好研究生"]
[12126046,"范云鹏","优秀","五好研究生"]
[22426005,"冯杨媛","优秀","五好研究生"]
[12326032,"冯逸丰","优秀","五好研究生"]
[22426056,"高旭东","优秀","五好研究生"]
[12326100,"高续洪","优秀","五好研究生"]
[22326054,"葛羽中","优秀","五好研究生"]
[12226097,"郭金泽","优秀","五好研究生"]
[12326047,"郭静筠","优秀","五好研究生"]
[12126038,"郭威","优秀","五好研究生"]
[12326108,"郭晓云","优秀","五号研究生"]
[22326018,"郭喆","优秀","五好研究生"]
[12226049,"韩君玮","优秀","五好研究生"]
[12326089,"韩思佳","优秀","五好研究生"]
[12226053,"何超威","优秀","五好研究生"]
[22426033,"洪彦棋","优秀","五好研究生"]
[12426088,"侯俊杰","优秀","五好研究生"]
[12426060,"侯徐泳","优秀","五好研究生"]
[12326042,"胡杜楠","优秀","五好研究生"]
[12226056,"胡炜媛","优秀","五好研究生"]
[12126024,"贾喻晓","优秀","五好研究生"]
[12526031,"蒋嘉惠琦","优秀","五好研究生"]
[22426015,"蒋嘉蔚","优秀","五好研究生"]
[22326132,"蒋双婷","优秀","五好研究生"]
[12126050,"鞠志杰","优秀","五好研究生"]
[22326104,"寇元昊","优秀","五号研究生"]
[12426018,"邝君儿","优秀","五好研究生"]
[22326060,"雷博睿","优秀","五好研究生"]
[12326106,"李光","优秀","五好研究生"]
[12426118,"李桂秀","优秀","五好研究生"]
[12226024,"李佳乐","优秀","五号研究生"]
[12326055,"李婷","优秀","五好研究生"]
[12226074,"李文丽","优秀","五好研究生"]
[12326036,"李闻天","优秀","五好研究生"]
[12326069,"李想","优秀","五好研究生"]
[12226087,"李昕阔","优秀","五好研究生"]
[12126027,"李旭","优秀","五好研究生"]
[12126082,"李昱征","优秀","五好研究生"]
[12426013,"李云龙","优秀","五好研究生"]
[22326051,"厉梦璐","优秀","五好研究生"]
[12326059,"梁珈源","优秀","五好研究生"]
[12326029,"林煌","优秀","五好研究生"]
[12126077,"林珈民","优秀","五好研究生"]
[12426113,"林业超","优秀","五好研究生"]
[12426012,"刘宸玮","优秀","五好研究生"]
[12226044,"刘慧","优秀","五好研究生"]
[12226082,"刘可凡","优秀","五好研究生"]
[22426030,"刘鹏飞","优秀","五号研究生"]
[12426014,"刘如敏","优秀","五好研究生"]
[12526016,"刘森","优秀","五好研究生"]
[12326027,"刘胜昊","优秀","五好研究生"]
[12126081,"刘硕","优秀","五好研究生"]
[22426096,"刘心逸","优秀","五好研究生"]
[12426042,"刘泽元","优秀","五好研究生"]
[22426021,"卢嘉敏","优秀","五好研究生"]
[12426054,"鲁晓楠","优秀","五好研究生"]
[12126068,"罗祯","优秀","五好研究生"]
[22426142,"马璐","优秀","五号研究生"]
[12326097,"孟睿阳","优秀","五好研究生"]
[22326110,"孟志","优秀","五好研究生"]
[12426004,"裴振","优秀","五好研究生"]
[12326079,"钱昇","优秀","五好研究生"]
[12326050,"申倩倩","优秀","五好研究生"]
[12326096,"沈漪杰","优秀","五好研究生"]
[12326067,"沈云鹏","优秀","五好研究生"]
[12526009,"宋潇敏","优秀","五好研究生"]
[22326118,"孙静怡","优秀","五好研究生"]
[12426056,"唐嘉轩","优秀","五号研究生"]
[22426017,"田静若兰","优秀","五号研究生"]
[12326072,"田雨竹","优秀","五好研究生"]
[22326090,"王贝宁","优秀","五好研究生"]
[12226042,"王金泽","优秀","五好研究生"]
[12426080,"王柯浩","优秀","五好研究生"]
[22326048,"王孟亚","优秀","五好研究生"]
[12126021,"王敏康","优秀","五好研究生"]
[12126061,"王茜","优秀","五好研究生"]
[22326123,"王世昌","优秀","五好研究生"]
[12526011,"王婷婷","优秀","五好研究生"]
[12326054,"王婷玉","优秀","五好研究生"]
[12326030,"王文波","优秀","五好研究生"]
[12226083,"王昕洋","优秀","五好研究生"]
[22426080,"王艺飞","优秀","五好研究生"]
[22426023,"王梓同","优秀","五号研究生"]
[22326111,"王梓懿","优秀","五好研究生"]
[22326013,"魏星","优秀","五号研究生"]
[12426095,"文星","优秀","五好研究生"]
[12126017,"沃子浩","优秀","五好研究生"]
[12326038,"吴梦怡","优秀","五好研究生"]
[22326137,"吴涛","优秀","五好研究生"]
[12526010,"吴天宇","优秀","五好研究生"]
[12126052,"夏群栋","优秀","五好研究生"]
[22426134,"夏鑫宇","优秀","五号研究生"]
[12426009,"夏宇凡","优秀","五好研究生"]
[12426112,"向阳","优秀","五好研究生"]
[22426084,"肖奕帆","优秀","五好研究生"]
[22326050,"徐颖","优秀","五好研究生"]
[12126058,"闫蕾","优秀","五好研究生"]
[12526001,"严宇超","优秀","五好研究生"]
[12526008,"杨方雯","优秀","五号研究生"]
[12126048,"杨月","优秀","五好研究生"]
[12226093,"杨志逸","优秀","五好研究生"]
[22426009,"尹添威","优秀","五号研究生"]
[12526114,"余程航","优秀","五好研究生"]
[12326065,"詹丽君","优秀","五号研究生"]
[12426031,"张可滢","优秀","五好研究生"]
[22426065,"张利萍","优秀","五好研究生"]
[12126029,"张瑞安","优秀","五好研究生"]
[12326083,"张文强","优秀","五好研究生"]
[12426002,"张正端","优秀","五好研究生"]
[12126064,"张洲晴","优秀","五好研究生"]
[22326124,"赵宇辰","优秀","五好研究生"]
[12426115,"赵志浩","优秀","五号研究生"]
[22326109,"赵壮","优秀","五好研究生"]
[12326068,"郑浩南","优秀","五好研究生"]
[22326122,"郑瑞婷","优秀","五好研究生"]
[22326022,"郑森哲","优秀","五好研究生"]
[22326125,"郑雅昕","优秀","五好研究生"]
[22326028,"郑裕秦","优秀","五好研究生"]
[22326002,"周边边","优秀","五好研究生"]
[12526012,"周福晨","优秀","五号研究生"]
[12126020,"周富威","优秀","五好研究生"]
[22326083,"周英杰","优秀","五号研究生"]
[12126063,"周昱","优秀","五好研究生"]
[22426130,"朱静雯","优秀","五好研究生"]
[22326113,"朱开琦","优秀","五好研究生"]

{"sheet":"3-优秀研究生干部","index":2,"n_rows":72,"n_cols":5,"rows_kept":72,"merged":[[0,0,0,4],[1,0,1,1],[1,2,1,3]]}
["  材料科学与工程学院 “优秀研究生干部”荣誉称号汇总表"]
["院系名称：材料科学与工程学院",null,"签字（盖章）：",null,"填报日期："]
["学号","姓名","综合素质评价结果","所获荣誉称号\n（请填写“优秀研究生干部”）","备注"]
[12126054,"蔡露城","优秀","优秀研究生干部"]
[22426146,"包晨琛","优秀","优秀研究生干部"]
[12426096,"陈汉阳","优秀","优秀研究生干部"]
[12126075,"陈泓旭","优秀","优秀研究生干部"]
[22426010,"陈稼臻","优秀","优秀研究生干部"]
[12226023,"陈明子","优秀","优秀研究生干部"]
[12126074,"陈星宇","优秀","优秀研究生干部"]
[22326043,"陈周萍","优秀","优秀研究生干部"]
[{"$f":"VLOOKUP(B12,[1]Sheet1!$C$4:$K$165,2,0)","v":12226072},"储非",{"$f":"VLOOKUP(B12,[1]Sheet1!$C$4:$K$165,9,0)","v":"优秀"},"优秀研究生干部"]
[{"$f":"VLOOKUP(B13,[1]Sheet1!$C$4:$K$165,2,0)","v":12426041},"储迎宇",{"$f":"VLOOKUP(B13,[1]Sheet1!$C$4:$K$165,9,0)","v":"优秀"},"优秀研究生干部"]
[{"$f":"VLOOKUP(B14,[1]Sheet1!$C$4:$K$165,2,0)","v":12126031},"戴子翔",{"$f":"VLOOKUP(B14,[1]Sheet1!$C$4:$K$165,9,0)","v":"优秀"},"优秀研究生干部"]
[22326116,"党萍萍","优秀","优秀研究生干部"]
[12526090,"杜管诗涵","优秀","优秀研究生干部"]
["12126073","范思源","优秀","优秀研究生干部"]
[22326119,"付依","优秀","优秀研究生干部"]
[22426114,"高邦帅","优秀","优秀研究生干部"]
[{"$f":"VLOOKUP(B20,[1]Sheet1!$C$4:$K$165,2,0)","v":12426069},"葛天乐",{"$f":"VLOOKUP(B20,[1]Sheet1!$C$4:$K$165,9,0)","v":"优秀"},"优秀研究生干部"]
[22326054,"葛羽中","优秀","优秀研究生干部"]
[12226097,"郭金泽","优秀","优秀研究生干部"]
[12326047,"郭静筠","优秀","优秀研究生干部"]
[12326089,"韩思佳","优秀","优秀研究生干部"]
[22426033,"洪彦棋","优秀","优秀研究生干部"]
[12326042,"胡杜楠","优秀","优秀研究生干部"]
[{"$f":"VLOOKUP(B27,[1]Sheet1!$C$4:$K$165,2,0)","v":12126024},"贾喻晓",{"$f":"VLOOKUP(B27,[1]Sheet1!$C$4:$K$165,9,0)","v":"优秀"},"优秀研究生干部"]
["22426081","江欣","优秀","优秀研究生干部"]
[{"$f":"VLOOKUP(B29,[1]Sheet1!$C$4:$K$165,2,0)","v":22326132},"蒋双婷",{"$f":"VLOOKUP(B29,[1]Sheet1!$C$4:$K$165,9,0)","v":"优秀"},"优秀研究生干部"]
[12326044,"解昕宇","优秀","优秀研究生干部"]
[22326060,"雷博睿","优秀","优秀研究生干部"]
[12426118,"李桂秀","优秀","优秀研究生干部"]
[12226074,"李文丽","优秀","优秀研究生干部"]
[{"$f":"VLOOKUP(B34,[1]Sheet1!$C$4:$K$165,2,0)","v":12326036},"李闻天",{"$f":"VLOOKUP(B34,[1]Sheet1!$C$4:$K$165,9,0)","v":"优秀"},"优秀研究生干部"]
[12226087,"李昕阔","优秀","优秀研究生干部"]
[12326059,"梁珈源","优秀","优秀研究生干部"]
[{"$f":"VLOOKUP(B37,[1]Sheet1!$C$4:$K$165,2,0)","v":12326101},"林坪",{"$f":"VLOOKUP(B37,[1]Sheet1!$C$4:$K$165,9,0)","v":"优秀"},"优秀研究生干部"]
[12326024,"林思宸","优秀","优秀研究生干部"]
[12426012,"刘宸玮","优秀","优秀研究生干部"]
[12526016,"刘森","优秀","优秀研究生干部"]
[12326027,"刘胜昊","优秀","优秀研究生干部"]
[22426096,"刘心逸","优秀","优秀研究生干部"]
[22426021,"卢嘉敏","优秀","优秀研究生干部"]
[12426046,"罗子昂","优秀","优秀研究生干部"]
[22326110,"孟志","优秀","优秀研究生干部"]
[22426066,"阮明","优秀","优秀研究生干部"]
[12326096,"沈漪杰","优秀","优秀研究生干部"]
[22226094,"宋潇敏","优秀","优秀研究生干部"]
[{"$f":"VLOOKUP(B49,[1]Sheet1!$C$4:$K$165,2,0)","v":12426053},"田君鸿",{"$f":"VLOOKUP(B49,[1]Sheet1!$C$4:$K$165,9,0)","v":"优秀"},"优秀研究生干部"]
[{"$f":"VLOOKUP(B50,[1]Sheet1!$C$4:$K$165,2,0)","v":12326090},"王国强",{"$f":"VLOOKUP(B50,[1]Sheet1!$C$4:$K$165,9,0)","v":"优秀"},"优秀研究生干部"]
[12126061,"王茜","优秀","优秀研究生干部"]
[12326054,"王婷玉","优秀","优秀研究生干部"]
[12326030,"王文波","优秀","优秀研究生干部"]
[12226083,"王昕洋","优秀","优秀研究生干部"]
[12226045,"王严","优秀","优秀研究生干部"]
[12226034,"王耀","优秀","优秀研究生干部"]
[22426059,"王一卓","优秀","优秀研究生干部"]
[22326039,"王云竹","优秀","优秀研究生干部"]
[22426023,"王梓同","优秀","优秀研究生干部"]
[22326013,"魏星","优秀","优秀研究生干部"]
[22426084,"肖奕帆","优秀","优秀研究生干部"]
[{"$f":"VLOOKUP(B62,[1]Sheet1!$C$4:$K$165,2,0)","v":22326050},"徐颖",{"$f":"VLOOKUP(B62,[1]Sheet1!$C$4:$K$165,9,0)","v":"优秀"},"优秀研究生干部"]
[12426044,"焉常超","优秀","优秀研究生干部"]
[12526001,"严宇超","优秀","优秀研究生干部"]
[{"$f":"VLOOKUP(B65,[1]Sheet1!$C$4:$K$165,2,0)","v":12226093},"杨志逸",{"$f":"VLOOKUP(B65,[1]Sheet1!$C$4:$K$165,9,0)","v":"优秀"},"优秀研究生干部"]
[22426065,"张利萍","优秀","优秀研究生干部"]
[{"$f":"VLOOKUP(B67,[1]Sheet1!$C$4:$K$165,2,0)","v":12326046},"赵凡雅",{"$f":"VLOOKUP(B67,[1]Sheet1!$C$4:$K$165,9,0)","v":"优秀"},"优秀研究生干部"]
[22426047,"赵庆龙","优秀","优秀研究生干部"]
[12126020,"周富威","优秀","优秀研究生干部"]
[12426084,"周宇轩","优秀","优秀研究生干部"]
[{"$f":"VLOOKUP(B71,[1]Sheet1!$C$4:$K$165,2,0)","v":12326102},"周姿",{"$f":"VLOOKUP(B71,[1]Sheet1!$C$4:$K$165,9,0)","v":"优秀"},"优秀研究生干部"]
[22426130,"朱静雯","优秀","优秀研究生干部"]

{"sheet":"4-研究生单项荣誉","index":3,"n_rows":113,"n_cols":6,"rows_kept":113,"merged":[[0,0,0,5],[1,0,1,1],[1,3,1,4]]}
[" 材料科学与工程学院 “研究生单项荣誉称号”汇总表"]
["院系名称：材料科学与工程学院",null,null,"签字（盖章）：",null,"填报日期："]
["学号","姓名","综合素质评价结果","所获荣誉称号\n（请填写“研究生单项荣誉”）","研究生单项荣誉类别\n请选填“思想政治表现”、“学术（实践）创新能力”、“体育”、“美育”、“劳育”","备注"]
[12526022,"鲍浙安","合格","研究生单项荣誉","劳育"]
[22326049,"蔡婉玥","合格","研究生单项荣誉","劳育"]
[12426038,"蔡雨佳","合格","研究生单项荣誉","劳育"]
[12326094,"陈昊","合格","研究生单项荣誉","学术（实践）创新能力"]
[22326134,"陈柳羲","合格","研究生单项荣誉","思想政治表现"]
[12426017,"陈爽","合格","研究生单项荣誉","劳育"]
[22426087,"陈忆蕊","合格","研究生单项荣誉","学术（实践）创新能力"]
[12326026,"池翰文","合格","研究生单项荣誉","体育"]
[12126053,"崔傲然","合格","研究生单项荣誉","学术（实践）创新能力"]
[22426016,"崔晓","合格","研究生单项荣誉","劳育"]
[22426044,"崔莹莹","合格","研究生单项荣誉","学术（实践）创新能力"]
[22426082,"邓晰艨","合格","研究生单项荣誉","学术（实践）创新能力"]
[22426061,"邓哲贤","合格","研究生单项荣誉","学术（实践）创新能力"]
[12226028,"付涵","合格","研究生单项荣誉","美育"]
[22426147,"古政浩","合格","研究生单项荣誉","学术（实践）创新能力"]
[22426006,"胡芳","合格","研究生单项荣誉","劳育"]
[12326098,"胡轩滢","合格","研究生单项荣誉","劳育"]
[22426037,"胡耀方","合格","研究生单项荣誉","学术（实践）创新能力"]
[12426066,"华君逸","合格","研究生单项荣誉","体育"]
[12426092,"黄昊宇","合格","研究生单项荣誉","体育"]
[22326102,"黄浦京","合格","研究生单项荣誉","劳育"]
[22326031,"黄振汉","合格","研究生单项荣誉","劳育"]
[22326014,"贾亚东","合格","研究生单项荣誉","劳育"]
[22426002,"焦宇泽","合格","研究生单项荣誉","学术（实践）创新能力"]
[22426137,"金俊泽","合格","研究生单项荣誉","思想政治表现"]
[22426034,"劳泽锋","合格","研究生单项荣誉","思想政治表现"]
[12226079,"李琛宇","合格","研究生单项荣誉","体育"]
[12426034,"李瑾阳","合格","研究生单项荣誉","学术（实践）创新能力"]
[12226027,"李岚勋","合格","研究生单项荣誉","体育"]
[22326140,"李礼","合格","研究生单项荣誉","思想政治表现"]
[22326047,"李龙","合格","研究生单项荣誉","劳育"]
[22426007,"李美辰","合格","研究生单项荣誉","学术（实践）创新能力"]
[12426082,"李璞琰","合格","研究生单项荣誉","学术（实践）创新能力"]
[22426113,"李容","合格","研究生单项荣誉","体育"]
[12226088,"李适意","合格","研究生单项荣誉","思想政治表现"]
[12226052,"李澍","合格","研究生单项荣誉","体育"]
[22326094,"李伟","合格","研究生单项荣誉","体育"]
[12326034,"李文彪","合格","研究生单项荣誉","学术（实践）创新能力"]
[12326075,"李晓莹","合格","研究生单项荣誉","学术（实践）创新能力"]
[12226033,"李馨薇","合格","研究生单项荣誉","美育"]
[12526026,"李翼廷","合格","研究生单项荣誉","体育"]
[12126044,"李雨阳","合格","研究生单项荣誉","学术（实践）创新能力"]
[22426106,"李泽源","合格","研究生单项荣誉","学术（实践）创新能力"]
[12126055,"李长丰","合格","研究生单项荣誉","体育"]
[12126030,"贾剑楠","合格","研究生单项荣誉","学术（实践）创新能力"]
[22326040,"林明泽","合格","研究生单项荣誉","劳育"]
[12526018,"林忠毅","合格","研究生单项荣誉","学术（实践）创新能力"]
[12226066,"刘幻","合格","研究生单项荣誉","劳育"]
[12226051,"刘艺","合格","研究生单项荣誉","学术（实践）创新能力"]
[22426025,"龙其冬","合格","研究生单项荣誉","劳育"]
[22326138,"龙欣","合格","研究生单项荣誉","劳育"]
[12226086,"娄芊潓","合格","研究生单项荣誉","劳育"]
[12226063,"罗逸豪","合格","研究生单项荣誉","体育"]
[22326080,"吕雄","合格","研究生单项荣誉","劳育"]
[22326062,"孟景晖","合格","研究生单项荣誉","学术（实践）创新能力"]
[12226025,"聂群霖","合格","研究生单项荣誉","劳育"]
[22426062,"任宇珂","合格","研究生单项荣誉","劳育"]
[22426064,"沈柯锋","合格","研究生单项荣誉","学术（实践）创新能力"]
[22426008,"舒芷欣","合格","研究生单项荣誉","学术（实践）创新能力"]
[22426013,"苏盟斐","合格","研究生单项荣誉","学术（实践）创新能力"]
[12526021,"孙昊文","合格","研究生单项荣誉","学术（实践）创新能力"]
[12126025,"孙曾一","合格","研究生单项荣誉","体育"]
[12426114,"唐俊文","合格","研究生单项荣誉","劳育"]
[22326010,"田立乾","合格","研究生单项荣誉","体育"]
[22426053,"汪力","合格","研究生单项荣誉","体育"]
[12426024,"王格","合格","研究生单项荣誉","劳育"]
[12426064,"王皓翔","合格","研究生单项荣誉","劳育"]
[12326076,"王静","合格","研究生单项荣誉","劳育"]
[22426029,"王书忠","合格","研究生单项荣誉","学术（实践）创新能力"]
[12326064,"王天姿","合格","研究生单项荣誉","劳育"]
[22426088,"王应雯","合格","研究生单项荣誉","劳育"]
[12426081,"文梦驰","合格","研究生单项荣誉","体育"]
[22426058,"翁高","合格","研究生单项荣誉","学术（实践）创新能力"]
[22426089,"吴武滨","合格","研究生单项荣誉","劳育"]
[12526005,"肖一鸣","合格","研究生单项荣誉","劳育"]
[22426018,"谢雅芸","合格","研究生单项荣誉","学术（实践）创新能力"]
[12426111,"辛海蒙","合格","研究生单项荣誉","劳育"]
[22326064,"忻泓哲","合格","研究生单项荣誉","学术（实践）创新能力"]
[12426008,"熊慧凡","合格","研究生单项荣誉","学术（实践）创新能力"]
[12426071,"徐宁","合格","研究生单项荣誉","思想政治表现"]
[22326017,"徐遥","合格","研究生单项荣誉","思想政治表现"]
[12226062,"许波","合格","研究生单项荣誉","劳育"]
[12426044,"焉常超","合格","研究生单项荣誉","劳育"]
[12526002,"闫晨曦","合格","研究生单项荣誉","学术（实践）创新能力"]
[12426063,"杨航","合格","研究生单项荣誉","体育"]
[22326103,"杨嘉琦","合格","研究生单项荣誉","体育"]
[12426025,"杨添皓","合格","研究生单项荣誉","劳育"]
[22326063,"杨亦霏","合格","研究生单项荣誉","劳育"]
[22426070,"杨雨菲","合格","研究生单项荣誉","学术（实践）创新能力"]
[22426028,"叶仓奂","合格","研究生单项荣誉","劳育"]
[12426032,"叶陈钦","合格","研究生单项荣誉","思想政治表现"]
[12226071,"叶浩函","合格","研究生单项荣誉","学术（实践）创新能力"]
[12326092,"叶力维","合格","研究生单项荣誉","劳育"]
[12326061,"应梦凡","合格","研究生单项荣誉","劳育"]
[22426060,"于梦丹","合格","研究生单项荣誉","体育"]
[22426144,"余风","合格","研究生单项荣誉","学术（实践）创新能力"]
[12426026,"臧子政","合格","研究生单项荣誉","学术（实践）创新能力"]
[12326093,"张恒昱","合格","研究生单项荣誉","劳育"]
[12426049,"张书沁","合格","研究生单项荣誉","学术（实践）创新能力"]
[12426104,"张怡涵","合格","研究生单项荣誉","劳育"]
[12326088,"章潘右文","合格","研究生单项荣誉","劳育"]
[22426112,"赵浩伟","合格","研究生单项荣誉","学术（实践）创新能力"]
[12226090,"赵宁馨","合格","研究生单项荣誉","学术（实践）创新能力"]
[12426033,"郑仕奇","合格","研究生单项荣誉","思想政治表现"]
[12426029,"周丹华","合格","研究生单项荣誉","劳育"]
[12326012,"周鼎鑫","合格","研究生单项荣誉","体育"]
[12326012,"周鼎鑫","合格","研究生单项荣誉","劳育"]
[12226064,"周芳","合格","研究生单项荣誉","劳育"]
[12426097,"朱晓芳","合格","研究生单项荣誉","学术（实践）创新能力"]
[22326033,"朱哲宽","合格","研究生单项荣誉","劳育"]